[OpenMOLE-devs] Build failed in Jenkins: openmole » org.openmole.ide.plugin.hook.file 0.8.0-SNAPSHOT #192

sysadmin at iscpif.fr sysadmin at iscpif.fr
Mon Jan 28 15:20:35 CET 2013


See <http://jenkins.iscpif.fr/job/openmole/org.openmole.ide$org.openmole.ide.plugin.hook.file/192/changes>

Changes:

[mathieu.leclaire] fix hook execution bug

------------------------------------------
projectStarted org.openmole.ide:org.openmole.ide.plugin.hook.file:0.8.0-SNAPSHOT
[INFO]                                                                         
[INFO] ------------------------------------------------------------------------
[INFO] Building org.openmole.ide.plugin.hook.file 0.8.0-SNAPSHOT 0.8.0-SNAPSHOT
[INFO] ------------------------------------------------------------------------
mojoStarted org.apache.maven.plugins:maven-clean-plugin:2.4.1(default-clean)
[INFO] 
[INFO] --- maven-clean-plugin:2.4.1:clean (default-clean) @ org.openmole.ide.plugin.hook.file ---
[INFO] Deleting <http://jenkins.iscpif.fr/job/openmole/org.openmole.ide$org.openmole.ide.plugin.hook.file/ws/target>
mojoSucceeded org.apache.maven.plugins:maven-clean-plugin:2.4.1(default-clean)
mojoStarted org.scalariform:scalariform-maven-plugin:0.1.3(default)
[INFO] 
[INFO] --- scalariform-maven-plugin:0.1.3:format (default) @ org.openmole.ide.plugin.hook.file ---
[ERROR] Error parsing Scala <http://jenkins.iscpif.fr/job/openmole/org.openmole.ide$org.openmole.ide.plugin.hook.file/ws/src/main/scala/org/openmole/ide/plugin/hook/file/AppendToCSVFileHookDataUI.scala>: Expected token RBRACE but got Token(EOF,,1854,)
[INFO] Modified 0 of 7 .scala files
mojoSucceeded org.scalariform:scalariform-maven-plugin:0.1.3(default)
mojoStarted org.apache.maven.plugins:maven-resources-plugin:2.4.3(default-resources)
[INFO] 
[INFO] --- maven-resources-plugin:2.4.3:resources (default-resources) @ org.openmole.ide.plugin.hook.file ---
[INFO] Using 'UTF-8' encoding to copy filtered resources.
[INFO] skip non existing resourceDirectory <http://jenkins.iscpif.fr/job/openmole/org.openmole.ide$org.openmole.ide.plugin.hook.file/ws/src/main/resources>
mojoSucceeded org.apache.maven.plugins:maven-resources-plugin:2.4.3(default-resources)
mojoStarted net.alchim31.maven:scala-maven-plugin:3.1.0(scala-compile-first)
[INFO] 
[INFO] --- scala-maven-plugin:3.1.0:add-source (scala-compile-first) @ org.openmole.ide.plugin.hook.file ---
[INFO] Add Source directory: <http://jenkins.iscpif.fr/job/openmole/org.openmole.ide$org.openmole.ide.plugin.hook.file/ws/src/main/scala>
[INFO] Add Test Source directory: <http://jenkins.iscpif.fr/job/openmole/org.openmole.ide$org.openmole.ide.plugin.hook.file/ws/src/test/scala>
mojoSucceeded net.alchim31.maven:scala-maven-plugin:3.1.0(scala-compile-first)
mojoStarted net.alchim31.maven:scala-maven-plugin:3.1.0(scala-compile-first)
[INFO] 
[INFO] --- scala-maven-plugin:3.1.0:compile (scala-compile-first) @ org.openmole.ide.plugin.hook.file ---
[INFO] <http://jenkins.iscpif.fr/job/openmole/org.openmole.ide$org.openmole.ide.plugin.hook.file/ws/src/main/scala>:-1: info: compiling
[INFO] Compiling 7 source files to <http://jenkins.iscpif.fr/job/openmole/org.openmole.ide$org.openmole.ide.plugin.hook.file/ws/target/classes> at 1359382781618
[ERROR] <http://jenkins.iscpif.fr/job/openmole/org.openmole.ide$org.openmole.ide.plugin.hook.file/ws/src/main/scala/org/openmole/ide/plugin/hook/file/AppendToCSVFileHookDataUI.scala>:43: error: Missing closing brace `}' assumed here
[ERROR] }
[ERROR] ^
[ERROR] one error found
mojoFailed net.alchim31.maven:scala-maven-plugin:3.1.0(scala-compile-first)
projectFailed org.openmole.ide:org.openmole.ide.plugin.hook.file:0.8.0-SNAPSHOT


More information about the OpenMOLE-devs mailing list